{"text_format":"1","workbook":"xlsx","n_sheets":5,"sheets":["Sheet1","C1","C2","C3","Sheet5"],"not_rendered":{"charts":0,"images":0,"macros":1,"external_links":0,"defined_names":1,"comments":0,"pivot_tables":0},"unopened":[],"bounds":{"document_bytes":16777216,"sheet_cells":100000,"rows_first":2000,"rows_last":500,"rows_between":2000,"halvings":0,"cell_chars":16384,"cell_head_chars":4096},"cells_cut":0,"cells_raw":0,"read":"whole","date_system":"1900"}

{"sheet":"Sheet1","index":0,"n_rows":5,"n_cols":2,"rows_kept":5,"cut":false,"hidden":false,"merged":[]}
[{"$f":"INDEX(ListSheets,ROWS($ZZ$1:$ZZ1))","v":"Sheet1"},{"$f":"HYPERLINK(\"#'\" & A1 & \"'!A1\",A1)","v":"Sheet1"}]
[{"$f":"INDEX(ListSheets,ROWS($ZZ$1:$ZZ2))","v":"C1"},{"$f":"HYPERLINK(\"#'\" & A2 & \"'!A1\",A2)","v":"C1"}]
[{"$f":"INDEX(ListSheets,ROWS($ZZ$1:$ZZ3))","v":"C2"},"C2"]
[{"$f":"INDEX(ListSheets,ROWS($ZZ$1:$ZZ4))","v":"C3"},"C3"]
[{"$f":"INDEX(ListSheets,ROWS($ZZ$1:$ZZ5))","v":"Sheet5"},"Sheet5"]

{"sheet":"C1","index":1,"n_rows":38,"n_cols":17,"rows_kept":38,"cut":false,"hidden":false,"merged":[]}
["Products","1399/10/14","1399/10/15","1399/10/16","1399/10/17","1399/10/18","1399/10/19","1399/10/20","1399/10/21","1399/10/22","1399/10/23","1399/10/24","1399/10/25","1399/10/26","1399/10/27","1399/10/28","1399/10/29"]
["P026",1637,4269,3310,3929,5834,2232,3087,5999,3131,4719,2828,1753,1557,3556,2004,4423]
["P079",2142,3007,3204,1310,4291,3683,3191,2259,5811,5456,2375,3745,3758,2593,2026,1889]
["P015",1139,5772,1812,2573,1920,2834,3137,3812,3379,5193,3222,1364,1105,3662,5924,3503]
["P003",5231,3956,2550,3423,2940,2995,2786,1499,2810,4926,4387,5073,4361,5727,4454,5186]
["P073",4513,1970,4550,3643,4481,2628,3824,2555,2849,3522,2129,2502,1984,5238,1656,2242]
["P024",1210,5635,5310,5803,5075,4200,2264,4211,5016,3510,4219,1756,5177,2046,1046,2373]
["P099",1438,3372,1461,2024,3116,5018,2999,4317,1106,1488,2239,1316,4363,3206,4567,3838]
["P005",1273,5855,1597,4986,5569,5104,2713,3775,4035,4129,1242,3076,2350,3014,5769,2237]
["P056",1424,5322,5328,4164,3229,3545,1798,1186,2809,3443,1585,4841,5893,5764,2276,1913]
["P022",1836,2656,4529,4977,2622,2465,5853,1230,2284,2910,4057,5765,5342,5471,2831,2135]
["P016",1190,4223,2173,2228,3829,1142,1124,3220,1428,5894,5379,2946,3442,4937,5999,1338]
["P023",5560,2747,4119,5835,1178,2784,2261,4937,2272,2962,2468,1576,1834,1129,5864,4908]
["P053",1474,2589,3204,4986,5519,1618,5356,3007,1891,3807,5804,3795,2427,3674,5438,1549]
["P035",4436,2645,3104,5386,4749,4464,4835,4992,2802,1619,1653,4093,4751,3034,3387,4745]
["P013",1797,4896,3710,1325,1784,1825,1353,2105,3363,3355,3624,4504,5416,5359,5757,3287]
["P017",1557,2619,4131,2275,2984,2594,4593,5547,5514,4921,1191,5331,4094,2952,2052,3754]
["P032",5162,2083,4288,2960,3801,4779,5022,4064,3491,4498,5592,5638,1714,2719,1025,4648]
["P084",1754,1535,3900,2186,4484,3426,2350,3888,5480,2551,4928,5343,5368,5096,4159,3507]
["P086",2089,3338,5666,3783,3850,2538,4799,4479,3491,3271,5727,2301,1664,4277,2403,2178]
["P080",5301,5646,5219,5652,4305,4825,4923,3422,2872,2941,2206,3976,3336,2384,4171,4624]
["P044",2579,5835,3884,3679,3393,4094,3399,4697,2813,1250,3198,3894,3887,5319,1976,2968]
["P083",3222,5273,5449,5870,5404,2919,5970,5128,5756,1732,3327,5656,2450,5543,5419,2417]
["P004",5206,4293,1149,2588,4495,3845,3137,5999,1287,2696,3109,3012,2487,2504,2498,4309]
["P007",3251,2785,2647,3517,4929,4581,2086,4846,4430,4056,5342,3090,2280,1790,2421,1823]
["P051",2242,1904,5623,2100,5657,2274,3824,5664,4363,5236,5626,2360,5032,5523,4028,4649]
["P021",1049,3589,2662,5438,2024,3018,3922,4344,2012,5299,3241,3626,1253,1230,3300,1702]
["P048",2790,3834,5083,5770,3121,1197,4844,4740,1061,1207,4636,5203,5568,1456,1519,2038]
["P046",1492,3650,3136,2915,2248,1228,4160,1883,2319,5138,2855,4032,4337,2659,3065,2445]
["P066",2913,1812,3890,5635,4695,2098,2525,1329,3211,1645,5132,4414,1835,1082,1959,5908]
["P036",2778,2642,1490,4698,1989,1820,5898,3392,4993,1936,5097,1532,1901,3066,4614,4342]
["P092",5869,2082,3766,2860,5873,1401,4479,5894,4336,1720,4883,1806,3460,2356,2247,1152]
["P008",5491,1043,5099,3301,4382,2919,5407,4381,4292,1334,2058,1074,1403,4057,2640,5744]
["P029",3439,5662,2083,2874,3010,2180,2449,1718,3672,4839,4697,2529,5508,2831,5285,4187]
["P045",1029,1294,5824,1479,4696,5352,2985,4490,3984,2172,3494,1929,4871,3261,4834,3991]
["P033",5985,1375,3005,4349,4125,4717,5456,4889,3171,4149,5814,3180,4476,4565,1272,4669]
["P061",2591,5049,2341,3200,3513,1031,1541,1015,3012,4218,1731,2945,5709,2322,3379,4593]
["P081",4949,2363,1784,4036,2793,2708,3247,4452,3877,1177,3960,4068,5323,5123,3047,2765]

{"sheet":"C2","index":2,"n_rows":38,"n_cols":17,"rows_kept":38,"cut":false,"hidden":false,"merged":[]}
["Products","1399/10/14","1399/10/15","1399/10/16","1399/10/17","1399/10/18","1399/10/19","1399/10/20","1399/10/21","1399/10/22","1399/10/23","1399/10/24","1399/10/25","1399/10/26","1399/10/27","1399/10/28","1399/10/29"]
["P026",2262,5142,1734,1648,4899,4497,1335,2051,4199,5793,2390,2106,1276,3604,3002,3139]
["P079",2367,1963,3659,4722,4309,2350,2996,5622,4253,1642,2355,1765,3614,3990,2562,2561]
["P015",5471,5416,1316,5087,5189,1148,3871,2881,5322,5990,2363,4902,4376,5936,1822,3937]
["P003",5864,2465,3783,1741,5818,4199,2872,1515,4520,4263,3191,1753,3837,2495,2858,5253]
["P073",2622,5800,4844,4624,5559,1511,3512,5128,5157,3792,5816,1005,3608,1912,1549,4738]
["P024",2972,3655,5777,4806,2925,1958,4196,3122,5089,3475,4370,2153,3255,1279,1933,4183]
["P099",1552,5710,2626,4192,1359,3898,5703,3004,4908,3212,2551,4445,1863,5884,1735,4549]
["P005",3146,3205,2859,4088,4612,1503,2912,4561,5891,3940,2190,2954,2473,1030,4298,4487]
["P056",4398,5143,1030,1423,3383,4328,2113,2143,1115,1482,1886,5726,4097,4927,3697,1357]
["P022",1569,2366,4766,1245,3155,5221,3402,1673,2995,2164,5416,2548,4020,3059,1682,1207]
["P016",1364,5747,3319,5001,5507,1426,5251,2464,4698,2208,4394,2856,5827,5617,4720,5726]
["P023",1594,4972,2901,5126,1983,3834,3982,4250,5206,2597,4748,4205,4611,2301,5317,4400]
["P053",1226,4636,2412,3411,5348,4617,3850,2050,2590,4735,4456,2801,4523,2494,3548,4374]
["P035",4018,1448,3180,4655,4130,2079,5080,1766,4672,1539,2562,1410,2887,5024,3882,1061]
["P013",1452,4052,2350,2501,5661,2134,1506,5644,5464,5193,3164,5762,5004,3505,5237,5781]
["P017",4666,5811,1825,5011,2635,1742,1064,1021,1959,4858,5679,2855,4195,3509,5322,4734]
["P032",4283,1379,2132,4851,1002,1892,5313,1922,4009,5936,4879,5849,5593,3832,4811,1032]
["P084",4462,1433,3786,1097,4187,3805,5803,1884,1515,5879,3251,2991,2766,3670,4373,2182]
["P086",1298,3558,1415,1135,4919,4744,5146,2382,2881,1596,3810,3455,2475,4310,4764,3352]
["P080",1714,3825,2360,5109,2006,5154,1957,3516,1451,5098,1986,3039,4520,4833,5938,3541]
["P044",4420,4867,4342,5171,3099,1481,5350,5246,2243,4288,2013,4732,3910,3581,3561,1349]
["P083",2098,2433,2474,1816,2929,3862,1082,1301,3338,2950,3067,4959,3408,4652,1284,5531]
["P004",4483,2430,1472,2604,1481,2313,2771,3556,4994,1357,1201,5310,2307,2117,4075,1561]
["P007",1357,5322,2582,4553,4682,3398,5303,3441,5668,4757,2351,1275,5711,3859,3717,4159]
["P051",1208,2282,1942,1254,4560,4010,5915,1102,3647,4762,5017,4097,3208,5736,3601,5707]
["P021",1857,4114,5254,1563,4118,1767,3927,4687,2694,1242,1344,5084,4812,2385,4108,4018]
["P048",4090,2331,4258,3889,3174,1906,5236,4973,1222,4076,5624,5028,1986,2309,5351,1515]
["P046",4862,1421,2188,3819,5686,4241,2229,3899,4106,1307,5374,5910,1980,4087,3985,1421]
["P066",2256,5888,2054,2160,2125,3205,3668,4715,1554,5732,1220,3616,4157,3425,3674,2273]
["P036",4951,5110,1053,1699,4099,2599,1731,3267,5703,1684,2572,1640,1159,3724,4801,4348]
["P092",3842,1217,5557,2994,1802,1117,3627,3190,4674,2795,4724,2895,5073,1285,3814,2602]
["P008",3801,3917,3159,1844,2184,1087,5098,5054,1338,5699,4572,3474,2172,1269,3816,4625]
["P029",5656,1451,5825,5062,1822,4114,2587,4305,5721,1158,3288,1958,4672,2025,4862,3579]
["P045",4859,5359,2232,3767,1343,4682,1450,3895,5301,3692,3084,1188,3090,3036,5198,2309]
["P033",2817,4154,3770,2504,2785,4757,1126,2306,4094,3661,5691,2223,5690,1395,3372,4237]
["P061",4233,5222,4643,2775,1659,3954,1574,1793,3439,3389,2690,1977,3641,1355,3205,5332]
["P081",1974,3796,3913,4781,4376,5472,4735,4834,5608,3260,4360,1405,2129,3435,5238,5425]

{"sheet":"C3","index":3,"n_rows":38,"n_cols":17,"rows_kept":38,"cut":false,"hidden":false,"merged":[]}
["Products","1399/10/14","1399/10/15","1399/10/16","1399/10/17","1399/10/18","1399/10/19","1399/10/20","1399/10/21","1399/10/22","1399/10/23","1399/10/24","1399/10/25","1399/10/26","1399/10/27","1399/10/28","1399/10/29"]
["P026",2795,5068,4384,2634,5499,1531,2688,5968,2778,3673,2993,1546,1430,4866,2614,5891]
["P079",2047,4444,1030,3454,2971,1875,2981,5255,4845,4920,2709,4949,2132,2702,5153,1038]
["P015",2454,1576,5873,1276,2383,3029,3187,3008,2829,3570,5971,1959,3494,2163,2538,4326]
["P003",3091,3695,1693,1792,2523,3845,3668,5221,5103,1160,1236,5796,4783,5008,2993,2924]
["P073",3265,3451,2128,3536,2311,2661,1927,3198,5131,5485,3118,1176,5200,3657,1025,3847]
["P024",3647,4839,3454,5270,3396,1977,5148,3444,5567,2745,3257,3577,2746,1637,2097,5590]
["P099",2589,2429,3955,1511,4648,1039,4148,1227,5734,1896,1020,3687,4621,3935,4639,1902]
["P005",1124,1438,5594,4324,3181,2494,4886,1089,5667,2693,2112,1650,3172,2426,3199,5341]
["P056",3025,3075,3894,3742,4211,4460,2283,5660,1022,4983,3512,2708,5234,2088,2962,2946]
["P022",3103,4090,5244,3604,4750,3695,4607,4674,3461,2953,3660,2231,5412,4010,1875,4543]
["P016",4867,2587,1909,1674,4516,1370,1463,2495,5246,2896,1196,2224,1133,5628,4364,2015]
["P023",5994,4968,5292,4600,3105,1493,1737,4529,4261,2054,1281,5882,2421,3615,3365,5260]
["P053",2580,1020,2957,2783,3088,2816,3778,2951,4474,2879,5992,5220,4311,3903,4774,4555]
["P035",3218,3441,2069,5047,3308,3284,4976,4020,4179,5585,2556,3653,1279,2948,3622,1728]
["P013",4593,3627,4399,5677,2143,3079,2132,4960,2927,4815,1386,3337,4307,3040,2036,3211]
["P017",4472,2208,2387,2861,4509,1788,1636,1773,3628,2962,4667,2554,2947,5669,3346,4447]
["P032",5331,2875,1254,1907,5768,4949,2637,5015,1520,2156,1401,2993,3330,4638,1644,3818]
["P084",3827,3418,4350,2301,1035,5575,5155,3844,3253,2824,5554,2933,4256,3440,1087,2909]
["P086",3885,3807,1685,2846,4222,1574,2274,4890,2438,3430,5625,1106,5620,3999,5917,2743]
["P080",4581,4830,1223,4066,5715,5974,4550,4801,1588,3515,3547,2499,2690,3969,1031,5032]
["P044",4698,4824,2574,4209,2586,5251,1190,4436,5906,4607,4583,4567,2711,5063,5791,2022]
["P083",3457,1911,1121,1012,2417,4894,5118,4191,4956,4362,5184,1283,5963,1035,5584,1135]
["P004",4630,3310,5108,5559,1047,4009,1696,2279,1355,1495,4528,3728,5098,5780,1592,2831]
["P007",1331,1391,1811,4539,3416,2039,2360,3157,2139,4610,5216,2043,4724,3594,3890,3717]
["P051",1217,5570,3486,2586,3488,4696,4620,5609,3529,1294,5168,1309,2598,4955,3278,4633]
["P021",2760,4785,2667,5511,4709,4162,5344,1187,5728,4553,1872,1341,1027,3844,3710,2076]
["P048",3046,5080,5612,2633,4368,3481,5119,1765,3246,4306,1824,4261,5585,5729,2833,5047]
["P046",5354,3955,2711,3981,3057,2278,1341,4742,3471,5684,2344,4271,2231,1745,2008,4641]
["P066",3986,4120,1324,4074,1031,5043,2787,4603,5115,2310,2142,1306,5104,2019,4852,3669]
["P036",3270,2638,4716,1822,1441,1434,5594,5663,3051,3678,3417,1340,1604,3089,3788,2905]
["P092",5190,1609,5881,1866,4127,3690,2639,2609,3199,5027,3609,3228,5147,3936,1117,3560]
["P008",3989,3070,4503,2052,4644,2057,5293,1700,1063,4647,5846,5112,5457,2017,1277,5402]
["P029",4758,4411,4933,3170,1683,2234,5329,1162,1950,5865,3234,5738,2096,5458,1982,5097]
["P045",1616,1215,4137,3142,4612,2889,3921,2643,1627,1466,4847,3206,1312,3883,3866,5489]
["P033",3946,5222,2385,1474,2253,1636,3744,5727,3205,1268,4788,4982,3386,3832,4909,3047]
["P061",3366,1360,4869,2373,4586,2190,5765,1557,4923,3156,4545,4041,3280,1679,4477,3571]
["P081",1508,2921,5012,5377,3797,5745,3206,2657,4279,1041,3799,5209,4014,2075,5286,5082]

{"sheet":"Sheet5","index":4,"n_rows":4,"n_cols":3,"rows_kept":4,"cut":false,"hidden":false,"merged":[]}
["فروشنده","C3"]
["نام محصول","P026"]
["تاریخ","1399/10/23"]
["مبلغ",{"$f":"INDEX('C1'!1:1048576,MATCH(B2,'C1'!A:A,0),MATCH(B3,'C1'!1:1,0))","v":4719},{"$f":"INDEX(INDIRECT(\"'\" & B1 & \"'!1:1048576\"),MATCH(B2,INDIRECT(\"'\" & B1 & \"'!A:A\"),0),MATCH(B3,INDIRECT(\"'\" & B1 & \"'!1:1\"),0))","v":3673}]